21天实战Caffe 5.3节 安装gflags时 make命令出错,求大神解答。

21天实战Caffe 中5.3节 安装gflags时  make命令出错(书中P39)
我按照书中所写下载了压缩包,一步一步运行命令行,在倒数第二个make命令的地方出错,报错信息是:
 
mx@N550:~/下载/Sources/gflags-2.1.1/build$ make
[ 12%] Building CXX object CMakeFiles/gflags-shared.dir/src/gflags.cc.o
/home/mx/下载/Sources/gflags-2.1.1/src/gflags.cc:90:20: fatal error: config.h: 没有那个文件或目录
compilation terminated.
CMakeFiles/gflags-shared.dir/build.make:62: recipe for target 'CMakeFiles/gflags-shared.dir/src/gflags.cc.o' failed
make[2]: *** [CMakeFiles/gflags-shared.dir/src/gflags.cc.o] Error 1
CMakeFiles/Makefile2:67: recipe for target 'CMakeFiles/gflags-shared.dir/all' failed
make[1]: *** [CMakeFiles/gflags-shared.dir/all] Error 2
Makefile:127: recipe for target 'all' failed
make: *** [all] Error 2
 
 
没太懂说的是什么,config.h文件应该是在文件夹里面的。
已邀请:

勉之wish

赞同来自: 卜居2016

可以试试用纯英文路径。说不定是中文路径 生成 config 文件的时候出了问题。

卜居2016 - 《深度学习:21天实战Caffe》作者,就职于阿里云计算有限公司。

赞同来自:

是什么系统?内核版本?GCC 版本?
 

JesseMx

赞同来自:

书中P39,ccmake命令过后,出现了配置界面,我按照书中所写改动了两处,修改完成后,按下C键,发现弹出如下提示,不知是不是cmake有问题?

2016-07-24_10-15-53屏幕截图.jpg

 

Simon_Feng

赞同来自:

请问这个问题您是怎么解决的?

刘阿建

赞同来自:

我也是这个问题

要回复问题请先登录注册