配置caffe时出错,Check failed: status == CURAND_STATUS_SUCCESS (201 vs. 0) CURAND_STATUS_LAUNCH_FAILURE

在执行sudo make runtest -j32 时出错。
 F0613 10:25:49.276244 26823 math_functions.cu:422] Check failed: status == CURAND_STATUS_SUCCESS (201 vs. 0)  CURAND_STATUS_LAUNCH_FAILURE
*** Check failure stack trace: ***
    @     0x7f0c030c05cd  google::LogMessage::Fail()
    @     0x7f0c030c2433  google::LogMessage::SendToLog()
    @     0x7f0c030c015b  google::LogMessage::Flush()
    @     0x7f0c030c2e1e  google::LogMessageFatal::~LogMessageFatal()
    @     0x7f0c006ac646  caffe::caffe_gpu_rng_uniform<>()
    @           0x88a438  caffe::RandomNumberGeneratorTest_TestRngUniform2GPU_Test<>::TestBody()
    @           0x947743  testing::internal::HandleExceptionsInMethodIfSupported<>()
    @           0x940d3a  testing::Test::Run()
    @           0x940e88  testing::TestInfo::Run()
    @           0x940f65  testing::TestCase::Run()
    @           0x94223f  testing::internal::UnitTestImpl::RunAllTests()
    @           0x942563  testing::UnitTest::Run()
    @           0x46f69d  main
    @     0x7f0bff81e830  __libc_start_main
    @           0x477529  _start
    @              (nil)  (unknown)
Makefile:531: recipe for target 'runtest' failed
make: *** [runtest] 已放弃 (core dumped)
已邀请:

要回复问题请先登录注册